snowboard
type: Concept
preferred label: Surf des neiges @fr
preferred label: スノーボード @ja-jp
preferred label: snow boarding @en-gb
preferred label: tabla de nieve (snowboard) @es
preferred label: Snowboarden @de
preferred label: Snowboard @it
definition: Deporte similar al surf o skate, descenso en la nieve practicado en una tabla individual, en vez de dos esquíes. @es
definition: Tavola singola cui sono assicurati i piedi per gare di discesa e di stile sulla neve @it
definition: Ausgeübt auf einem Brett (anstatt zwei Ski). @de
definition: Esporte que consiste em manter o equilíbrio em cima de uma prancha que desliza por uma descida coberta de neve.
definition: 2枚のスキー板でなく1枚の板で雪上を滑走する競技 @ja-jp
definition: sport de glisse pratiqué avec une planche sur des pistes enneigées @fr
definition: Practiced with a single board (rather than two skis) @en-gb
definition: Desporto que consiste em manter o equilíbrio em cima de uma prancha que desliza por uma descida coberta de neve.
note: nessuno @it
in scheme: subjectcode
created: 2000-10-30T12:00:00+00:00
modified: 2010-12-15T17:01:09+00:00
broader: http://cv.iptc.org/newscodes/subjectcode/15000000
narrower: http://cv.iptc.org/newscodes/subjectcode/15053001
narrower: http://cv.iptc.org/newscodes/subjectcode/15053002