Softball
type: Concept
preferred label: softball @pt-br
preferred label: ソフトボール @ja-jp
preferred label: sóftbol @es
definition: 野球に似ているが、より大きな柔らかいボールと細いバットを使い、塁同士の間隔が短く、イニング数も少ない @ja-jp
definition: Similar al béisbol pero con una pelota más grande y liviana, un bate más delgado, espacios más cortos entre las bases y con menos entradas. @es
definition: Jogo semelhante ao beisebol mas com um bola maior e mais leve, um bastão mais fino, espaços mais curtos entre as bases e menos entradas. @pt-pt
definition: Ähnlich dem Baseball aber mit größeren und weicheren Bällen, dünneren Schlägern, kürzeren Lücken zwischen den Stationen und weniger Innenfelder. @de
definition: Similar to baseball but with a larger and softer ball, a thinner bat, shorter gaps between bases and less innings @en-gb
definition: Jeu similaire au baseball qui se pratique avec une balle plus grosse et moins dure, une batte plus fine et des distances de terrain plus courtes. @fr
definition: Simile al baseball ma con una palla più grossa e meno dura, una mazza più sottile, distanze inferiori tra una base e l'altra, e meno innings
note: typo fixed in Explanation @en-gb
note: nessuno
in scheme: subjectcode
created: 2000-10-30T12:00:00+00:00
modified: 2010-12-15T17:01:09+00:00
broader: http://cv.iptc.org/newscodes/subjectcode/15000000