Pattinaggio di velocità
type: Concept
preferred label: speed skating @en-gb
preferred label: Eisschnelllauf @de
preferred label: patinação (velocidade) @pt-br
preferred label: スピードスケート @ja-jp
preferred label: patinagem (velocidade) @pt-pt
preferred label: Patinage de vitesse @fr
preferred label: patinaje de velocidad @es
definition: Timed races competed by two skaters at a time on an oval ice track @en-gb
definition: Carrera de duración limitada donde compiten dos patinadores al mismo tiempo sobre una pista ovalada de hielo. @es
definition: Corridas disputadas por 2 patinadores em pista oval de gelo. @pt-pt
definition: 2人のスケーターが楕円形のスケートリンクで時間を競う @ja-jp
definition: Corsa a tempo su ghiaccio nella quale due concorrenti pattinano insieme su una pista ovale
definition: Zeitrennen, asugeübt von zwei Läufern zur gleichen Zeit auf einer ovalen Eisbahn. @de
definition: courses disputées par paires sur une piste de glace selon le système du contre-la-montre. @fr
note: nessuno
in scheme: subjectcode
created: 2000-10-30T12:00:00+00:00
modified: 2010-12-15T17:01:09+00:00
broader: http://cv.iptc.org/newscodes/subjectcode/15000000
narrower: http://cv.iptc.org/newscodes/subjectcode/15056001
narrower: http://cv.iptc.org/newscodes/subjectcode/15056002
narrower: http://cv.iptc.org/newscodes/subjectcode/15056003
narrower: http://cv.iptc.org/newscodes/subjectcode/15056004
narrower: http://cv.iptc.org/newscodes/subjectcode/15056005
narrower: http://cv.iptc.org/newscodes/subjectcode/15056006
narrower: http://cv.iptc.org/newscodes/subjectcode/15056007
narrower: http://cv.iptc.org/newscodes/subjectcode/15056008
narrower: http://cv.iptc.org/newscodes/subjectcode/15056009
narrower: http://cv.iptc.org/newscodes/subjectcode/15056010
narrower: http://cv.iptc.org/newscodes/subjectcode/15056011
narrower: http://cv.iptc.org/newscodes/subjectcode/15056012
narrower: http://cv.iptc.org/newscodes/subjectcode/15056013
narrower: http://cv.iptc.org/newscodes/subjectcode/15056014