1500 m
type: Concept
preferred label: １５００ｍ @ja-jp
preferred label: 1.500 m @es
preferred label: 1500m @fr
definition: Corrida de patinagem de velocidade de 1500m.
definition: Rennen im Eisschnelllauf über 1500 m. @de
definition: Corrida de patinação de velocidade de 1500m.
definition: Carrera de velocidad de patinaje sobre 1.500 m @es
definition: 1500mスピードスケートレース @ja-jp
definition: Gara di 1500 m di pattinaggio di velocità @it
definition: Speed skating race over 1500m @en-gb
definition: course de patinage de vitesse sur 1500 m @fr
note: nessuno @it
in scheme: subjectcode
created: 2000-10-30T12:00:00+00:00
modified: 2010-12-15T17:01:09+00:00
broader: http://cv.iptc.org/newscodes/subjectcode/15056000
broad match: http://cv.iptc.org/newscodes/mediatopic/20001067