３０００ｍ
type: Concept
preferred label: 3000 m @en-gb
preferred label: 3.000 m @es
preferred label: 3000m @fr
definition: Carrera de velocidad de patinaje sobre 3.000 m @es
definition: Speed skating race over 3000m @en-gb
definition: Gara di 3000 m di pattinaggio di velocità @it
definition: course de patinage de vitesse sur 3000 m @fr
definition: Corrida de patinagem de velocidade de 3000m. @pt-pt
definition: Corrida de patinação de velocidade de 3000m. @pt-br
definition: Rennen im Eisschnelllauf über 3000. @de
definition: 3000mスピードスケートレース
note: nessuno @it
in scheme: subjectcode
created: 2000-10-30T12:00:00+00:00
modified: 2010-12-15T17:01:09+00:00
broad match: http://cv.iptc.org/newscodes/mediatopic/20001067
broader: http://cv.iptc.org/newscodes/subjectcode/15056000