500 m
type: Concept
preferred label: st 500 m @es
preferred label: ５００ｍ @ja-jp
preferred label: Short track 500 m @it
preferred label: st500m @fr
definition: Corrida de patinação de pista curta de 500m.
definition: 500mショートトラックスケートレース @ja-jp
definition: Short track speed skate race over 500m @en-gb
definition: course de short track sur 500m @fr
definition: Carrera corta de velocidad de patinaje sobre 500 m @es
definition: Corrida de patinagem de pista curta de 500m.
definition: Gara di pattinaggio dove un certo numero di pattinatori (solitamente da 4 a 6) pattinano contemporaneamente su una breve pista al coperto (111 m). @it
definition: Kurzstrecken Rennen über 500 m. @de
note: nessuno @it
in scheme: subjectcode
created: 2000-10-30T12:00:00+00:00
modified: 2010-12-15T17:01:09+00:00
broader: http://cv.iptc.org/newscodes/subjectcode/15056000
broad match: http://cv.iptc.org/newscodes/mediatopic/20001067