1500 m livre
type: Concept
preferred label: 1500 m freestyle @en-gb
preferred label: 1500 m Freistil @de
preferred label: 1.500m libre @es
preferred label: １５００ｍ自由形 @ja-jp
preferred label: 1500 m livres
preferred label: 1500 m libre @fr
preferred label: 1500 m sl @it
definition: Competidores cubren a nado 1.500 metros en cualquier estilo, aunque *crawl* es universalmente más empleado. @es
definition: I concorrenti coprono 1500 m in stile libero @it
definition: Os nadadores nadam 1500m em qualquer estilo, embora o nado crawl seja o estilo mais usado.
definition: longueur à parcourir dans n'importe quel style de nage @fr
definition: Os nadadores nadam 1500m em qualquer estilo, embora o crawl seja o estilo mais usado.
definition: Competitors cover 1500m in any style, though front crawl is universally employed @en-gb
definition: Wettkämpfer schwimmen 1500 m egal in welchem Stil, wobei meist das Kraulschwimmen bevorzugt wird. @de
definition: 競泳者は自由な泳法で1500mを泳ぐ。通常クロール泳法を選ぶ @ja-jp
note: nessuno @it
in scheme: subjectcode
created: 2000-10-30T12:00:00+00:00
modified: 2010-12-15T17:01:09+00:00
broader: http://cv.iptc.org/newscodes/subjectcode/15062000
broad match: http://cv.iptc.org/newscodes/mediatopic/20001071