4x200 m livres
type: Concept
preferred label: relay 4x200 m freestyle @en-gb
preferred label: ８００ｍリレー @ja-jp
preferred label: Relais 4x200 m libre @fr
preferred label: 4x200 m livre
preferred label: libero 4 x 200 m sl @it
preferred label: relevo 4 x 200 metros libre @es
preferred label: Staffel 4x200 m Freistil @de
definition: relais de quatre nageurs devant parcourir la longueur en utilisant n'importe quel style de nage @fr
definition: Teams of four swimmers cover 200m freestyle in a 800m race @en-gb
definition: 4人競泳者のチームが、各200mを分担する自由形800mレース @ja-jp
definition: Equipes de 4 nadadores nadam 200m de nado livre em corrida de 800m.
definition: Squadre di quattro nuotatori che coprono ciascuno 200 m in stile libero in una gara di 800 m @it
definition: Teams mit 4 Schwimmern legen je 200 m Freistil zurück über eine 800 m Strecke. @de
definition: Equipas de 4 nadadores nadam 200m livres em corrida de 800m.
definition: Equipos de cuatro nadadores cubren 200 metros libre cada uno, en una carrera de 800 metros. @es
note: nessuno @it
in scheme: subjectcode
created: 2000-10-30T12:00:00+00:00
modified: 2010-12-15T17:01:09+00:00
broad match: http://cv.iptc.org/newscodes/mediatopic/20001071
broader: http://cv.iptc.org/newscodes/subjectcode/15062000