50 m dorso
type: Concept
preferred label: 50 m costas @pt-br
preferred label: 50 m Rückenschwimmen @de
preferred label: ５０ｍ背泳ぎ @ja-jp
preferred label: 50m dos @fr
preferred label: 50m espalda @es
preferred label: 50 m backstroke @en-gb
definition: longueur à parcourir en nageant sur le dos @fr
definition: Competidores cubren 50 metros estilo espalda. @es
definition: Os nadadores nadam 50m de costas. @pt-pt
definition: 競泳者は背泳で50mを泳ぐ @ja-jp
definition: I concorrenti coprono 50 m in stile dorso
definition: Wettkämpfer legen 50 m im Rückenschwimmen zurück. @de
definition: Competitors cover 50m in the backstroke style @en-gb
note: nessuno
in scheme: subjectcode
created: 2000-10-30T12:00:00+00:00
modified: 2010-12-15T17:01:09+00:00
broader: http://cv.iptc.org/newscodes/subjectcode/15062000
broad match: http://cv.iptc.org/newscodes/mediatopic/20001071