100 m peito
type: Concept
preferred label: 100m pecho @es
preferred label: 100 m bruços
preferred label: １００ｍ平泳ぎ @ja-jp
preferred label: 100 m Brustschwimmen @de
preferred label: 100 m rana @it
preferred label: 100 m breaststroke @en-gb
preferred label: 100m brasse @fr
definition: Corrida de 100m de nado de peito, em que o nadador realiza movimentos para a frente e para fora com os braços e para trás e para fora com as pernas.
definition: 100 m Strecke im Brustschwimmen. Auf dem Bauch liegend sich vorwärts und außerhalb mit den Armen und rückwärts mit den Beinen bewegend. @de
definition: Una gara di 100 m in stile rana, frontale, con movimenti di spinta in avanti e indietro con le braccia, e con movimenti di spinta in avanti e indietro con le gambe @it
definition: longueur à parcourir en nageant la brasse: le corps est allongé sur la poitrine. Les mouvements de bras et de jambes doivent être simultanés dans le même plan horizontal et les mains poussées ensemble en avant à partir de la poitrine. @fr
definition: A 100m race in the breaststroke style, on the front, effecting forward and outward push movements with the arms and backward and outward pushes with the legs @en-gb
definition: 100m平泳ぎレース。水中で腕を前方から外側に押し出したり、脚を外側から後方に蹴り出して前に進む @ja-jp
definition: Corrida de 100 de bruços, em que o nadador realiza movimentos para a frente e para fora com os braços e para trás e para fora com as pernas.
definition: Una carrera de 100 metros en estilo pecho, realizando movimientos de empuje hacia adelante y atrás con los brazos y hacia atrás y hacia afuera con las piernas. @es
note: nessuno @it
in scheme: subjectcode
created: 2000-10-30T12:00:00+00:00
modified: 2010-12-15T17:01:09+00:00
broader: http://cv.iptc.org/newscodes/subjectcode/15062000
broad match: http://cv.iptc.org/newscodes/mediatopic/20001071