Nuoto sincronizzato tecnico
type: Concept
preferred label: シンクロ・テクニカル @ja-jp
preferred label: rutina técnica sincronizada @es
preferred label: Natation synchronisée programme technique @fr
preferred label: Synchronschwimmen Disziplin @de
preferred label: sincronizada @pt-br
preferred label: synchronised technical routine @en-gb
definition: Contestants obtain points from 10 sitting judges by executing certain synchronised artistic shapes and movements in the water. In the technical programme, competitors must execute a range of specific moves in a given order. @en-gb
definition: I concorrenti ricevono i voti di dieci giudici eseguendo nell'acqua figure e movimenti sincronizzati. Nel programma tecnico i concorrenti devono compiere una serie di mosse specifiche e in un determinato ordine
definition: 競技者は、水中での一連の芸術的な形や動作で10人の着席した審判から点数を得る。テクニカルプログラムでは、競技者は決められた順序と動きの範囲内で演技しなければならない @ja-jp
definition: nager en exécutant des figures artistiques en synchronisation avec la ou les partenaires. Dans le programme technique, les nageuses présentent des figures spécifiques dans un ordre donné. @fr
definition: Los nadadores obtienen puntos de diez jurados al ejecutar determinados movimientos sincronizados y artísticos. En el programa técnico, los competidores deben ejecutar una serie de movimientos específicos en un orden dado. @es
definition: Wettkämpfer erhalten Punkte von einer zehnköpfigen Jury für synchrone artistische Formen und Bewegungen im Wasser. In der technischen Disziplin müssen die Schwimmer eine Rangfolge von speziellen Bewegungen einhalten. @de
definition: Os nadadores executam determinados movimentos sincronizados e artísticos na água, sendo avaliados por 10 juízes. No programa técnico, os nadadores devem executar uma série de figuras específicas segundo determinada ordem. @pt-br
definition: Prova em que os nadadores executam determinados movimentos sincronizados e artísticos na água, sendo avaliados por 10 juízes. No programa técnico, os nadadores devem executar uma série de figuras específicas segundo determinada ordem. @pt-pt
note: nessuno
in scheme: subjectcode
created: 2000-10-30T12:00:00+00:00
modified: 2010-12-15T17:01:09+00:00
broader: http://cv.iptc.org/newscodes/subjectcode/15062000