triathlon
type: Concept
preferred label: triatlo @pt-pt
preferred label: triatlón @es
preferred label: トライアスロン @ja-jp
preferred label: Triathlon @de
definition: An endurance multi-sport where competitors first swim, then cycle and then run a road race. Distances vary according to the competition, the Olympic version being 1.5, 40 and 10km respectively.
definition: épreuve d'endurance qui comprend trois disciplines différentes enchaînées successivement (nage, cyclisme, course à pied). @fr
definition: Prova de resistência que inclui três disciplinas diferentes - natação, ciclismo e corrida a pé - executadas em cadeia. As distâncias variam de acordo com a competição. @pt-pt
definition: 競技者は最初に水泳、それから自転車、その後にランニングをする耐久の複合競技。距離は競技会によって様々で、オリンピックではそれぞれ1.5km、40km、10kmになる @ja-jp
definition: Un deporte de resistencia con varias disciplinas, donde los competidores primero nadan, luego afrontan una competencia ciclista y luego corren. Las distancias varían de acuerdo a la competición: la versión olímpica cumple 1,5, 4 y 10 kilómetros. @es
definition: Ein Ausdauersport, bei dem die Wettkämpfer erst Schwimmen, dann Radfahren und dann auf der Straße laufen. Je nach Wettbewerb variieren die Distanzen, die olympische Version erfordert 1,5 km, 40 km und 10 km. @de
definition: Sport multidisciplinare di resistenza nel quale i concorrenti, in ordine, nuotano, vanno in bicicletta e corrono per strada. Le distanze della competizione olimpica sono di 1, 5, 40 e 10 km @it
note: nessuno @it
note: typo fixed in Explanation
in scheme: subjectcode
created: 2000-10-30T12:00:00+00:00
modified: 2010-12-15T17:01:09+00:00
broader: http://cv.iptc.org/newscodes/subjectcode/15000000
narrower: http://cv.iptc.org/newscodes/subjectcode/15066001
narrower: http://cv.iptc.org/newscodes/subjectcode/15066002
narrower: http://cv.iptc.org/newscodes/subjectcode/15066003