Pallanuoto
type: Concept
preferred label: polo acuático @es
preferred label: Wasserball @de
preferred label: 水球 @ja-jp
preferred label: polo aquático @pt-pt
preferred label: water polo @en-gb
preferred label: Water polo @fr
definition: Desporto náutico praticado em piscina e disputador por duas equipes de 7 nadadores, que só podem usar uma mão para passar a bola ou nadar com ela antes de arremessar ao gol adversário. @pt-br
definition: Desporto náutico praticado em piscina e disputador por duas equipas de 7 nadadores, que só podem usar uma mão para passar a bola ou nadar com ela antes de arremessar à baliza adversária. @pt-pt
definition: sport nautique qui se pratique dans une piscine : deux équipes de 7 joueurs essayent de marquer le plus de buts possibles à l'équipe adverse @fr
definition: Played in a pool between two teams of 7, who must stay afloat and can only use one hand to pass the ball or swim with it before trying to throw it into the opponents net to score goals. @en-gb
definition: Wird in einem Wasserbecken ausgetragen von zwei Teams mit jeweils 7 Spielern, die sich im Wasser befinden und nur eine Hand benutzen dürfen, um den Ball zu werfen oder mit diesem schwimmen müssen, bevor sie ihn in das gegnerische Netz werfen, um Punkte zu machen. @de
definition: 7人構成の2つのチームがプールで競技する。競技者は水中に浮んでいなくてはならず、片手のみを使ってボールをパスしたり、ゴールを獲得しようとして対戦相手のネットへボールを投げ込むまでボールと一緒に泳ぐ @ja-jp
definition: Jugado en una piscina entre dos equipos de siete, que deben mantenerse a flote. Sólo pueden utilizar una mano para pasar el balón e intentar marcar un gol. El equipo que ataca tiene 35 segundos de posesión de balón y no puede hundir el esférico. @es
definition: Si gioca in una piscina tra due squadre di sette giocatori ciascuna che cercano di stare a galla e possono usare soltanto una mano per passarsi la palla o nuotare con essa prima di cercare di tirare la palla nella rete avversaria per segnare
note: typo fixed in Explanation @en-gb
note: nessuno
in scheme: subjectcode
created: 2000-10-30T12:00:00+00:00
modified: 2010-12-15T17:01:09+00:00
broader: http://cv.iptc.org/newscodes/subjectcode/15000000