arremesso
type: Concept
preferred label: dos tiempos @es
preferred label: Clean and Jerk @de
preferred label: ジャーク @ja-jp
preferred label: clean and jerk @en-gb
preferred label: épaulé-jeté @fr
preferred label: Due tempi (salto e strappo) @it
definition: La barra es elevada primero hasta los hombros, luego elevada por encima de la cabeza y se debe mantener allí con las piernas estiradas. @es
definition: amener une barre à disques à bout de bras en deux temps : d'abord au niveau des épaules ensuite au-dessus de la tête avec les bras tendus @fr
definition: A barra de pesos é primeiro levantada até os ombros e só depois arremessada acima da cabeça, posição que o atleta deve manter durante alguns segundos com as pernas esticadas.
definition: Il bilanciere è prima sollevato all'altezza delle spalle e poi spinto al di sopra della testa con uno strappo deciso e va tenuto mantenendo le gambe unite @it
definition: The bar is first lifted to the shoulders and then jerk it above the head and keep it there while maintaining straight legs @en-gb
definition: A barra de pesos é primeiro levantada até aos ombros e só depois arremessada acima da cabeça, posição que o atleta deve manter durante alguns segundos com as pernas esticadas.
definition: バーを最初に肩まで持ち上げ、その後に頭上に持ち上げて、足をまっすぐ揃えるまで保ち続ける(競技) @ja-jp
definition: Die Stange wird zu den Schultern gehoben, dann über den Kopf und dort gehalten während die Beine gestreckt werden. @de
note: nessuno @it
in scheme: subjectcode
created: 2000-10-30T12:00:00+00:00
modified: 2010-12-15T17:01:09+00:00
broader: http://cv.iptc.org/newscodes/subjectcode/15070000