75 kg
type: Concept
preferred label: ７５ｋｇ級 @ja-jp
preferred label: 75kg @fr
definition: Categoria de peso do competidor
definition: Categoria di peso del concorrente @it
definition: 重量挙げの重量階級 @ja-jp
definition: Competitor weight category in weightlifting @en-gb
definition: catégories de poids du compétiteur @fr
definition: Categoría de peso, del competidor de halterofilia. @es
definition: Gewichtsklasse im Gewichtheben @de
note: nessuno @it
in scheme: subjectcode
created: 2000-10-30T12:00:00+00:00
modified: 2010-12-15T17:01:09+00:00
broader: http://cv.iptc.org/newscodes/subjectcode/15070000
broad match: http://cv.iptc.org/newscodes/mediatopic/20001093