Oltre 75 kg
type: Concept
preferred label: mais de 675 kg @pt-pt
preferred label: Plus de 75kg @fr
preferred label: ７５ｋｇ超級 @ja-jp
preferred label: over 75 kg @en-gb
preferred label: más de 75 kg @es
preferred label: über 75 kg @de
definition: 重量挙げの重量階級 @ja-jp
definition: Competitor weight category in weightlifting @en-gb
definition: Categoría de peso, del competidor de halterofilia. @es
definition: Categoria de peso do competidor @pt-br
definition: Gewichtsklasse im Gewichtheben @de
definition: Categoria di peso del concorrente
definition: catégories de poids du compétiteur @fr
note: nessuno
in scheme: subjectcode
created: 2000-10-30T12:00:00+00:00
modified: 2010-12-15T17:01:09+00:00
broader: http://cv.iptc.org/newscodes/subjectcode/15070000
broad match: http://cv.iptc.org/newscodes/mediatopic/20001093