Windsurf
type: Concept
preferred label: windsurfing @en-gb
preferred label: windsurf @es
preferred label: Planche à voile @fr
preferred label: Windsurfen @de
preferred label: ウィンドサーフィン @ja-jp
definition: Contestants must complete a marked out course as fast as possible on a windsurf board @en-gb
definition: Contendientes deben completar una curso acuático demarcado tan rápido como puedan desplazándose en una tabla de vela @es
definition: 競技者はウインドサーブボードでできる限り早くコースを完走しなければならない(競技) @ja-jp
definition: compétitition consistant à parcourir une distance donnée dans un minimum de temps avec une planche à voile @fr
definition: Gli atleti devono completare il più velocemente possibile un percorso segnato stando su una tavola da windsurf
definition: Competição de prancha a vela em que os participantes devem completar o mais rápido possível um percurso aquático demarcado. @pt-br
definition: Competição de prancha à vela em que os participantes devem completar o mais rápido possível um percurso aquático demarcado. @pt-pt
definition: Wettkämpfer müssen so schnell wir möglich einen bestimmten Kurs auf einem Surfboard zurücklegen. @de
note: nessuno
in scheme: subjectcode
created: 2000-10-30T12:00:00+00:00
modified: 2010-12-15T17:01:09+00:00
broader: http://cv.iptc.org/newscodes/subjectcode/15000000
narrower: http://cv.iptc.org/newscodes/subjectcode/15071001
narrower: http://cv.iptc.org/newscodes/subjectcode/15071002
narrower: http://cv.iptc.org/newscodes/subjectcode/15071003
narrower: http://cv.iptc.org/newscodes/subjectcode/15071004