58 kg
type: Concept
preferred label: ５８ｋｇ級 @ja-jp
preferred label: 58kg @fr
definition: Gewichtsklasse im Ringen @de
definition: catégorie de poids du lutteur @fr
definition: Categoria de peso do competidor @pt-pt
definition: 競技者重量区分 @ja-jp
definition: Categorías de peso @es
definition: Competitor weight category in wrestling @en-gb
definition: Categoria di peso del concorrente
note: nessuno
in scheme: subjectcode
created: 2000-10-30T12:00:00+00:00
modified: 2010-12-15T17:01:09+00:00
broad match: http://cv.iptc.org/newscodes/mediatopic/20001098
broader: http://cv.iptc.org/newscodes/subjectcode/15072000