Universíadas
type: Concept
preferred label: universiadas de verano @es
preferred label: Universiade @it
preferred label: 夏季ユニバーシアード @ja-jp
preferred label: Universíada
preferred label: Sommeruniversiade @de
preferred label: Universiade d'été @fr
preferred label: Summer universiade @en-gb
definition: Universíada
definition: 夏季ユニバーシアード大会 @ja-jp
definition: Universiade (gare mondiali fra atleti universitari) estiva @it
definition: --- @de
definition: universiadas de verano @es
definition: Universiade d'été @fr
definition: Summer universiade @en-gb
definition: Provas para universitários, no verão.
note: nessuno @it
in scheme: subjectcode
created: 2000-10-30T12:00:00+00:00
modified: 2010-12-15T17:01:09+00:00
broad match: http://cv.iptc.org/newscodes/mediatopic/20001108
broader: http://cv.iptc.org/newscodes/subjectcode/15073000