Giochi invernali della buona volontà
type: Concept
preferred label: Jogos da Boa Vontade de Inverno @pt-br
preferred label: Winter Goodwill Games @en-gb
preferred label: Goodwill Games hiver @fr
preferred label: juegos invernales de la buena voluntad @es
preferred label: 冬季交歓試合 @ja-jp
definition: --- @de
definition: Jogos da Boa Vontade de Inverno @pt-pt
definition: Winter Goodwill Games @en-gb
definition: juegos invernales de la buena voluntad @es
definition: 冬季交歓試合 @ja-jp
definition: Goodwill Games hiver @fr
definition: Giochi invernali della buona volontà
note: nessuno
in scheme: subjectcode
created: 2000-10-30T12:00:00+00:00
modified: 2010-12-15T17:01:09+00:00
broad match: http://cv.iptc.org/newscodes/mediatopic/20001108
broader: http://cv.iptc.org/newscodes/subjectcode/15073000