Giochi estivi della buona volontà
type: Concept
preferred label: Summer Goodwill Games @en-gb
preferred label: 夏季交歓試合 @ja-jp
preferred label: Jogos da Boa Vontade @pt-pt
preferred label: juegos estivales de la buena voluntad @es
preferred label: Goodwill Games été @fr
preferred label: Sommer Goodwill Games @de
definition: Jogos da Boa Vontade @pt-br
definition: Goodwill Games été @fr
definition: 夏季交歓試合 @ja-jp
definition: Summer Goodwill Games @en-gb
definition: juegos estivales de la buena voluntad @es
definition: Giochi estivi della buona volontà
definition: --- @de
note: nessuno
in scheme: subjectcode
created: 2000-10-30T12:00:00+00:00
modified: 2010-12-15T17:01:09+00:00
broader: http://cv.iptc.org/newscodes/subjectcode/15073000
broad match: http://cv.iptc.org/newscodes/mediatopic/20001108