Giochi mondiali
type: Concept
preferred label: 世界大会 @ja-jp
preferred label: World games @en-gb
preferred label: Mondiaux @fr
preferred label: Jogos Mundiais @pt-pt
preferred label: juegos mundiales @es
preferred label: Weltspiele @de
definition: Una competizione in cui gareggiano atleti di classe mondiale
definition: Competencia desarrollada por atletas de clase mundial @es
definition: A competition featuring world class athletes @en-gb
definition: Competição com atletas internacionais. @pt-br
definition: 世界レベルで活躍する選手による競技会 @ja-jp
definition: rassemblement sportif à l'échelle mondiale @fr
definition: Wettbewerb, der von Athleten der Weltklasse ausgetragen wird. @de
note: nessuno
in scheme: subjectcode
created: 2000-10-30T12:00:00+00:00
modified: 2010-12-15T17:01:09+00:00
broader: http://cv.iptc.org/newscodes/subjectcode/15073000