copa da liga
type: Concept
preferred label: Liga @de
preferred label: Coupe de Ligue @fr
preferred label: league cup @en-gb
preferred label: taça da liga
preferred label: copa de liga @es
preferred label: リーグカップ @ja-jp
preferred label: Coppa della lega @it
definition: compétion au sein d'une ligue sportive @fr
definition: Competencia dentro de una liga deportiva. @es
definition: スポーツリーグの中での競技会 @ja-jp
definition: A competition within a sports league @en-gb
definition: Una competizione interna ad una lega sportiva @it
definition: Competição de uma liga esportiva.
definition: Wettkampf innerhalb einer Sportliga. @de
definition: Competição de uma liga desportiva.
note: nessuno @it
in scheme: subjectcode
created: 2000-10-30T12:00:00+00:00
modified: 2010-12-15T17:01:09+00:00
broader: http://cv.iptc.org/newscodes/subjectcode/15073000
broad match: http://cv.iptc.org/newscodes/mediatopic/20001108