Campionato continentale di primo livello
type: Concept
preferred label: 大陸選手権大会第１レベル @ja-jp
preferred label: continental championship 1st level @en-gb
preferred label: campeonato continental de primer nivel @es
preferred label: Championnat continental 1er niveau @fr
preferred label: Kontinentale Meisterschaft 1. Stufe @de
preferred label: campeonato continental nível 1 @pt-br
definition: Campeonato del que toman parte competidores de máximo nivel de un continente. @es
definition: Campeonato com participantes de 1º nível de um continente. @pt-br
definition: A championship where top level competitors from a single continent take part @en-gb
definition: championnat entre pays d'un même continent rassemblant des équipes du niveau le plus élévé @fr
definition: １つの大陸からトップ級の選手が集まる選手権 @ja-jp
definition: Un campionato in cui gli atleti di primo livello che vi prendono parte sono di un unico continente
definition: Meisterschaft, an der die besten Wettkämpfer eines Kontinents teilnehmen. @de
note: nessuno
in scheme: subjectcode
created: 2000-10-30T12:00:00+00:00
modified: 2010-12-15T17:01:09+00:00
broad match: http://cv.iptc.org/newscodes/mediatopic/20001109
broader: http://cv.iptc.org/newscodes/subjectcode/15073000