Campionato continentale di secondo livello
type: Concept
preferred label: campeonato continental nível 2 @pt-pt
preferred label: Championnat continental 2ème niveau @fr
preferred label: Kontinentale Meisterschaft 2. Stufe @de
preferred label: continental championship 2nd level @en-gb
preferred label: 大陸選手権大会第２レベル @ja-jp
preferred label: campeonato continental de segundo nivel @es
definition: Campeonato com participantes de 2º nível de um continente. @pt-br
definition: Meisterschaft an der die 2. besten Wettkämpfer eines Kontinents teilnehmen. @de
definition: Un campionato in cui vi partecipano atleti di secondo livello e di un unico continente
definition: １つの大陸から第２級レベルの選手が集まる選手権 @ja-jp
definition: Campeonato del que toman parte competidores de segundo nivel de un continente. @es
definition: championnat entre pays d'un même continent rassemblant des équipes du 2ème niveau @fr
definition: A championship where second string competitors from a single continent take part @en-gb
note: nessuno
in scheme: subjectcode
created: 2000-10-30T12:00:00+00:00
modified: 2010-12-15T17:01:09+00:00
broader: http://cv.iptc.org/newscodes/subjectcode/15073000
broad match: http://cv.iptc.org/newscodes/mediatopic/20001109