Campionato nazionale di II livello
type: Concept
preferred label: campeonato nacional nível 2 @pt-br
preferred label: Championnat national 2eme niveau @fr
preferred label: ナショナル選手権大会第２レベル @ja-jp
preferred label: campeonato nacional de segundo nivel @es
preferred label: national championship 2nd level @en-gb
preferred label: Nationale Meisterschaft 2. Stufe @de
definition: １つの国から第２級の選手が集まる選手権 @ja-jp
definition: Meisterschaft an der die 2. besten Wettkämpfer eines Landes teilnehmen. @de
definition: Campeonato com participantes de 2º nível de um país. @pt-pt
definition: A championship where second string competitors from a single continent take part @en-gb
definition: championnat au sein d'un même pays rassemblant des équipes du 2ème niveau @fr
definition: Un campionato cui prendono parte concorrenti di II livello di una singola nazione
definition: Campeonato del que toman parte competidores de segundo nivel de una nación. @es
note: nessuno
in scheme: subjectcode
created: 2000-10-30T12:00:00+00:00
modified: 2010-12-15T17:01:09+00:00
broad match: http://cv.iptc.org/newscodes/mediatopic/20001115
broader: http://cv.iptc.org/newscodes/subjectcode/15073000