Campionato nazionale di III livello
type: Concept
preferred label: campeonato nacional nível 3 @pt-br
preferred label: Nationale Meisterschaft 3. Stufe @de
preferred label: campeonato nacional de tercer nivel @es
preferred label: Championnat national 3ème niveau @fr
preferred label: national championship3rdlevel @en-gb
preferred label: ナショナル選手権大会第３レベル @ja-jp
definition: Un campionato cui prendono parte i concorrenti di III livello di una singola nazione
definition: Campeonato com participantes de 3º nível de um país. @pt-pt
definition: １つの国から第３級の選手が集まる選手権 @ja-jp
definition: Campeonato del que toman parte competidores de tercer nivel de una nación. @es
definition: A championship where third string competitors from a single continent take part @en-gb
definition: championnat au sein d'un même pays rassemblant des équipes du 3 ème niveau @fr
definition: Meisterschaft an der die 3. besten Wettkämpfer eines Landes teilnehmen. @de
note: nessuno
in scheme: subjectcode
created: 2000-10-30T12:00:00+00:00
modified: 2010-12-15T17:01:09+00:00
broad match: http://cv.iptc.org/newscodes/mediatopic/20001115
broader: http://cv.iptc.org/newscodes/subjectcode/15073000