Grande Prémio
type: Concept
preferred label: Grande Prêmio
preferred label: Grand Prix @de
preferred label: gran premio @es
preferred label: Gran Premio @it
preferred label: グランプリ @ja-jp
definition: Competizione sportiva di alto livello, molto spesso automobilismo o di ippica @it
definition: Competición deportiva de alto nivel, sobre todo carreras @es
definition: Sportwettbewerb auf hohem Niveau, meist im Motorsport. @de
definition: Competição desportiva de alto nível, sobretudo de desportos motorizados.
definition: High level sports competition, most often motor racing @en-gb
definition: 大抵はモーターレースで行われる、ハイレベルのスポーツ競技 @ja-jp
definition: Competição esportiva de alto nível, sobretudo de esportes motorizados.
definition: Compétition de haut niveau, la plupart du temps automobile @fr
note: nessuno @it
in scheme: subjectcode
created: 2000-10-30T12:00:00+00:00
modified: 2010-12-15T17:01:09+00:00
broad match: http://cv.iptc.org/newscodes/mediatopic/20001108
broader: http://cv.iptc.org/newscodes/subjectcode/15073000