Competizione continentale
type: Concept
preferred label: コンチネンタル･トーナメント @ja-jp
preferred label: Kontinentales Tunier @de
preferred label: torneio continental @pt-pt
preferred label: continental tournament @en-gb
preferred label: Tournoi continental @fr
preferred label: circuito continental @es
definition: Torneio com participantes de um continente. @pt-br
definition: Turnier an dem Wettkämpfer aus einem Kontinent teilnehmen. @de
definition: １つの大陸から選手が集まるトーナメント大会 @ja-jp
definition: Circuito del que toman parte competidores de un continente. @es
definition: Competizione cui prendono parte atleti di un singolo continente
definition: Tournament where competitors from a single continent take part @en-gb
definition: tournoi entre compétiteurs d'un même continent @fr
note: nessuno
in scheme: subjectcode
created: 2000-10-30T12:00:00+00:00
modified: 2010-12-15T17:01:09+00:00
broader: http://cv.iptc.org/newscodes/subjectcode/15073000
broad match: http://cv.iptc.org/newscodes/mediatopic/20001108