Gara nazionale
type: Concept
preferred label: Nationales Tunier @de
preferred label: torneio nacional @pt-pt
preferred label: national tournament @en-gb
preferred label: Tournoi national @fr
preferred label: circuito nacional @es
preferred label: ナショナル･トーナメント @ja-jp
definition: tournoi entre compétiteurs d'un même pays @fr
definition: １つの国から選手が集まるトーナメント大会 @ja-jp
definition: Circuito del que toman parte competidores de una nación. @es
definition: Torneio com participantes de um país. @pt-pt
definition: Turnier an dem Wettkämpfer aus einem Land teilnehmen. @de
definition: Competizione cui prendono parte concorrenti di una singola nazione
definition: Tournament where competitors from a single nation take part @en-gb
note: nessuno
in scheme: subjectcode
created: 2000-10-30T12:00:00+00:00
modified: 2010-12-15T17:01:09+00:00
broad match: http://cv.iptc.org/newscodes/mediatopic/20001108
broader: http://cv.iptc.org/newscodes/subjectcode/15073000