Gara amichevole
type: Concept
preferred label: Compétition amicale @fr
preferred label: competencia amistosa @es
preferred label: 親善試合 @ja-jp
preferred label: friendly competition @en-gb
preferred label: Freundschaftsspiel @de
preferred label: competição particular @pt-pt
definition: Sports giocati ma non in competizione
definition: Sports played but not in a tournament @en-gb
definition: competencia amistosa @es
definition: Competição amistosa, fora de campeonato ou torneio. @pt-br
definition: Compétition amicale @fr
definition: トーナメント試合ではないスポーツ @ja-jp
definition: Sport der ausgeübt wird ohne Turnier. @de
note: nessuno
in scheme: subjectcode
created: 2000-10-30T12:00:00+00:00
modified: 2010-12-15T17:01:09+00:00
broader: http://cv.iptc.org/newscodes/subjectcode/15073000
broad match: http://cv.iptc.org/newscodes/mediatopic/20001108