Mini golf
type: Concept
preferred label: ミニゴルフ @ja-jp
preferred label: minigolfe @pt-br
preferred label: mini golf @es
preferred label: mini golf sport @en-gb
preferred label: Minigolfsport @de
preferred label: Mini golf sport @fr
definition: Jogo semelhante ao golfe, praticado em campo artificial de menores dimensões. @pt-pt
definition: Gioco in cui le palle devono essere imbucate con una mazza in un percorso artificiale in meno tiri possibili
definition: A game where balls must be holed on an artificial course in as few strokes from the club as possible @en-gb
definition: より少ない打数でクラブから人工コース上の穴にボールを打ち込まなければならないゲーム @ja-jp
definition: Spiel bei dem Bälle eingelocht werden in einem speziellen Kurs mit so wenig Versuchen wie möglich. @de
definition: jeu consistant à placer une balle avec un club dans une série de trous répartis le long d'un parcours artificiel, et ce, en moins de coups possible @fr
definition: Juego similar al golf de campo, donde las pelotas deben ser embocadas en hoyos de una cancha artificial en la menor cantidad de golpes posibles. @es
note: nessuno
in scheme: subjectcode
created: 2000-10-30T12:00:00+00:00
modified: 2010-12-15T17:01:09+00:00
broader: http://cv.iptc.org/newscodes/subjectcode/15000000