bandy
type: Concept
preferred label: バンディー @ja-jp
preferred label: Bandy @de
definition: Sport di squadra tradizionalmente giocato in Svezia e in Finlandia dal quale è derivato l'hockey su ghiaccio. @it
definition: Wird im Freien auf Eis gespielt. Die Größe des Spielfeldes entspricht einem Fußballfeld. Benutzt werden Schlittschuhe wie im Eishockey und ein kleiner Kunststoffball. Die Schläger der Spieler ähneln Eishockeyschlägern, sind aber kürzer und stärker gerundet. @de
definition: sorte de hockey sur glace joué en extérieur sur une surface grande comme un terrain de football @fr
definition: Se juega al aire libre, sobre hielo. El tamaño de la pista es aproximadamente el de una cancha de fútbol. Los patines son similares a los de hockey sobre hielo y Se utiliza una pequeña pelota. @es
definition: Played outdoors on ice. The size of the ice rink is about the size of a soccer field. Skates like ice hockey. A small hard ball is used for playing. Players play with sticks, much like in ice hockey, but the sticks are shorter and more rounded.
definition: Espécie de hóquei no gelo, jogado ao ar livre, sobre uma superfície aproximadamente do tamanho de um campo de futebol. @pt-pt
definition: 屋外の氷上でプレーされる。アイス･リンクの大きさは、サッカー競技場の大きさ。スケート靴はアイスホッケーのようである。小さい堅いボールがプレーするために使われる。選手がスティックでプレーし、極めてアイスホッケーのようである。しかし、スティックはより短くて、そしていっそう丸い @ja-jp
note: Explanation shortened
note: nessuno @it
in scheme: subjectcode
created: 2000-10-30T12:00:00+00:00
modified: 2010-12-15T17:01:09+00:00
broader: http://cv.iptc.org/newscodes/subjectcode/15000000