flying disc
type: Concept
preferred label: Frisbee @fr
preferred label: フライングディスク @ja-jp
preferred label: disco volador @es
preferred label: frisbee @pt-br
preferred label: disco voador @pt-pt
definition: jeu d'adresse entre des équipes qui se lancent un disque en matière plastique @fr
definition: Grupo de provas disputadas com um disco voador de plástico. @pt-pt
definition: A group of events all played with a flying plastic disc. The exact regulation for the disc is different in different events but it has to be unbroken of solid plastic and a production model with no modification. Flying disc is sometimes called Frisbee.
definition: Un grupo de competencias, todas jugadas con un disco volador de plástico. La regulación exacta del disco difiere en los distintos eventos. También denominado Freesbe Bu. @es
definition: Eine Reihe von Wettbewerben, die mit einer fliegenden Kunststoffwurfscheibe gespielt werden. Die genauen Regeln für die Wurfscheiben variieren je nach Wettbewerb, aber verwendet werden unzerbrechliche aus solidem Kunststoff gefertigte Scheiben, deren Aussehen nie verändert ist. Manchmal auch Frisbee genannt. @de
definition: 全ての競技種目のグループは、フライング･プラスチック･ディスクでプレーされる。ディスクの正確なレギュレーションは、様々な競技種目で異なっている。しかし壊れていない固体のプラスチックで、変更がない生産モデルでなければならない。フライング･ディスクは、時々フリスビーと呼ばれる @ja-jp
definition: Serie di gare tutte con un disco volante di plastica. La grandezza del disco è diversa nelle varie gare @it
note: nessuno @it
note: Explanation shortened
in scheme: subjectcode
created: 2000-10-30T12:00:00+00:00
modified: 2010-12-15T17:01:09+00:00
broader: http://cv.iptc.org/newscodes/subjectcode/15000000
narrower: http://cv.iptc.org/newscodes/subjectcode/15077001
narrower: http://cv.iptc.org/newscodes/subjectcode/15077002
narrower: http://cv.iptc.org/newscodes/subjectcode/15077003
narrower: http://cv.iptc.org/newscodes/subjectcode/15077004
narrower: http://cv.iptc.org/newscodes/subjectcode/15077005
narrower: http://cv.iptc.org/newscodes/subjectcode/15077006
narrower: http://cv.iptc.org/newscodes/subjectcode/15077007
narrower: http://cv.iptc.org/newscodes/subjectcode/15077008
narrower: http://cv.iptc.org/newscodes/subjectcode/15077009
narrower: http://cv.iptc.org/newscodes/subjectcode/15077010