casting
type: Concept
preferred label: lanzamiento @es
preferred label: Casting @de
preferred label: キャスティング @ja-jp
definition: Utilisation d'un équipement de pêche pour atteindre une cible et marquer des points @fr
definition: 釣具を使用し、目標に当てて得点を得る @ja-jp
definition: Uso de equipamento de pesca para atingir um alvo e marcar pontos.
definition: Si usa un equipaggiamento adatto alla pesca per colpire un bersaglio e segnare punti @it
definition: Ziel- und Weitwerfen mit Angelgeräten. @de
definition: Usando un equipamiento de pesca para alcanzar una diana y anotar puntos @es
definition: Using fishing equipment to hit a target and score points @en-gb
note: nessuno @it
in scheme: subjectcode
created: 2000-10-30T12:00:00+00:00
modified: 2010-12-15T17:01:09+00:00
broader: http://cv.iptc.org/newscodes/subjectcode/15000000