cabo de guerra
type: Concept
preferred label: Tauziehen @de
preferred label: 綱引き @ja-jp
preferred label: jogo da corda
preferred label: tug-of-war @en-gb
preferred label: Tiro alla fune @it
preferred label: Tug-of-war @fr
preferred label: tira y afloja con cuerda @es
definition: Due squadre tirano una fune ciascuna nella propria direzione @it
definition: Dos equipos tirando de cada lado de una cuerda @es
definition: Uma equipa tenta derrubar a equipa adversária, puxando uma corda.
definition: Deux équipes tirent d'une corde chacune de leur côté @fr
definition: Duas equipas puxam de cada lado de uma corda.
definition: 2つのチームがロープを引っ張り合う @ja-jp
definition: Zwei Teams ziehen gegeneinander an einem Tau. @de
definition: Two teams pulling against each other on a rope @en-gb
note: nessuno @it
in scheme: subjectcode
created: 2000-10-30T12:00:00+00:00
modified: 2010-12-15T17:01:09+00:00
broader: http://cv.iptc.org/newscodes/subjectcode/15000000