duatlo
type: Concept
preferred label: duatlón @es
preferred label: Duathlon @fr
preferred label: duathlon @en-gb
preferred label: デュアスロン @ja-jp
definition: Epreuve de course à pied et de VTT @fr
definition: Duathlon @de
definition: Prova de corrida a pé e de MTB.
definition: Prova de corrida a pé e de BTT.
definition: ランニングとバイク(自転車)という２つの種目を組み合わせた競技 @ja-jp
definition: Una variante del triathlon è il duathlon, articolato anch'esso in tre prove, ma con l'alternarsi di due discipine: la sequenza è infatti composta da una prima frazione di corsa, quindi una di ciclismo, per concludere con un'altra di corsa @it
definition: Duatlón @es
note: nessuno @it
in scheme: subjectcode
created: 2003-11-26T12:00:00+00:00
modified: 2012-07-10T12:00:00+00:00
broader: http://cv.iptc.org/newscodes/subjectcode/15000000