Snowbiking
type: Concept
preferred label: snowbiking @en-gb
preferred label: スノーバイク @ja-jp
preferred label: Skibob @de
definition: vélo sur neige @fr
definition: 雪上の個人スポーツ。競技者は短いスキーを履き、前後にスキーが付いたバイクに乗る。以前はスキーボブと呼ばれていた @ja-jp
definition: Einzelsportart auf Schnee auf einem Skibob, der Athlet benutzt zwei Kurz-Ski, bevorzugter Name: Skibob. @de
definition: Deporte individual en la nieve sobre una tabla @es
definition: Sport individuale sulla neve in sella ad una snow bike (bicicletta con sci al posto delle ruote), gli atleti hanno due mini sci.
definition: Individual sport on snow on a snow bike, the athlete has two mini skis, previous name: ski bob @en-gb
definition: Desporto individual com uma bicicleta sobre a neve. @pt-pt
definition: Esporte individual com uma bicicleta sobre a neve. @pt-br
note: nessuno
in scheme: subjectcode
created: 2003-11-26T12:00:00+00:00
modified: 2012-07-10T12:00:00+00:00
broad match: http://cv.iptc.org/newscodes/mediatopic/20000822
broader: http://cv.iptc.org/newscodes/subjectcode/15000000