Jukendo
type: Concept
preferred label: jukendo @pt-br
preferred label: 銃剣道 @ja-jp
definition: Arte marcial tradicional japonesa que usa uma baioneta em madeira. @pt-pt
definition: Arte marcial japonés con una arma de madera que simboliza un rifle con bayoneta @es
definition: Japanese traditional martial art using a model rifle made of wood. *Juken* means a rifle or gun with blade (bayonet). (Programme of National Sports Festival in Japan) @en-gb
definition: Japanische traditionelle Kampfsportart mit einem Holzgewehr. *Juken* bedeutet Gewehr oder Waffe mit Bajonett. (Programm des Nationalen Sportfestivals in Japan) @de
definition: Art martial traditionnel japonais avec une baïonnette en bois @fr
definition: 木製のライフル銃を用いる日本古来の武道。「銃剣」は銃に装着する刃を意味する(国民体育大会競技種目) @ja-jp
definition: Tradizionale arte marziale giapponese nella quale si usa un modello di fucile in legno. La parola *Juken* indica un fucile o una pistola con lama (baionetta).
note: nessuno
in scheme: subjectcode
created: 2004-04-22T12:00:00+00:00
modified: 2012-07-10T12:00:00+00:00
broader: http://cv.iptc.org/newscodes/subjectcode/15000000