sepaktakraw
type: Concept
preferred label: sepak takraw @es
preferred label: Sepak Takraw @de
preferred label: セパタクロー @ja-jp
preferred label: Sepak takraw @fr
definition: Ein Spiel ähnlich dem Volleyball, bei dem man nicht unbedingt die Hände benutzen muss. Benutzt wird ein Rattanball. @de
definition: Sport similaire au volley-ball mais sans les mains @fr
definition: Gioco molto diffuso in Oriente simile alla pallavolo nel quale però non è permesso usare le mani. @it
definition: Juego parecido al voleíbol donde no se usa las manos y la pelota esta hecha de ratán. @es
definition: Jogo semelhante ao voleibol mas em que não se usam as mãos e a bola é feita de ratã ou de bambu.
definition: Jogo semelhante ao vôlei mas em que não se usam as mãos e a bola é feita de ratã ou de bambu.
definition: The game like volleyball which must not use a hand. The ball made of rattan is used. (Programme of National Sports Festival in Japan) @en-gb
definition: 手を使ってはいけないバレーボールのような競技。籐製のボールが使用される(訳注：現在はプラスチック製のものを使用)(国民体育大会競技種目) @ja-jp
note: nessuno @it
in scheme: subjectcode
created: 2004-04-22T12:00:00+00:00
modified: 2012-07-10T12:00:00+00:00
broader: http://cv.iptc.org/newscodes/subjectcode/15000000