estatísticas (desporto)
type: Concept
preferred label: estatísticas (esporte)
preferred label: Freccette @it
preferred label: Dart @de
preferred label: darts @en-gb
preferred label: ダーツ @ja-jp
definition: Os jogadores competem atirando dardos de metal a um alvo circular na parede, dividido em segmentos de várias cores.
definition: Zwei Spieler werfen mit kleinen Pfeilen auf eine runde Scheibe, die in Segmente mit verschiedenen Zahlenwerten aufgeteilt ist. @de
definition: Two players compete by throwing metal darts at a wall-mounted circular board divided radially into segments of different scores @en-gb
definition: ２人の競技者が金属製の矢を壁に掛けられた円盤に投げる。円盤は放射状に区分され、得点が異なる。 @ja-jp
definition: Competizione fra due giocatori che lanciano dei dardi di metallo su un bersaglio, di forma circolare e diviso radialmente in vari segmenti corrispondenti ai punti, affisso ad un muro @it
note: nessuno @it
in scheme: subjectcode
created: 2006-08-21T12:00:00+00:00
modified: 2012-07-10T12:00:00+00:00
broader: http://cv.iptc.org/newscodes/subjectcode/15000000