Bodybuilding
type: Concept
preferred label: culturismo @pt-br
preferred label: bodybuilding @en-gb
preferred label: ボディービル @ja-jp
definition: Attività ginnica che stimola l'accrescimento delle masse muscolari, il cui risultato viene poi valutato in competizioni in cui i giudici si esprimono su sviluppo, simmetria, proporzioni, ecc.
definition: Modalidade em que os participantes exibem músculos muito desenvolvidos. @pt-pt
definition: Modellierung des Körpers durch gezielte Muskelübungen und Aufbau von Muskelmasse und der Definition ästhetischer Bewertung. @de
definition: 競技者は隆々たる筋肉を示し、全体としての美的効果を競う @ja-jp
definition: A person displays pronounced muscle tone and exaggerated muscle mass and definition for overall aesthetic effect @en-gb
note: nessuno
in scheme: subjectcode
created: 2006-08-21T12:00:00+00:00
modified: 2012-07-10T12:00:00+00:00
broader: http://cv.iptc.org/newscodes/subjectcode/15000000
broad match: http://cv.iptc.org/newscodes/mediatopic/20000822