Rivoluzione
type: Concept
preferred label: revoluções @pt-pt
preferred label: Revolution @de
preferred label: 革命 @ja-jp
preferred label: revoluciones @es
preferred label: revolutions @en-gb
preferred label: Révolutions @fr
definition: Cambiamento spesso attuato in forma violenta del sistema di governo di una nazione realizzato da forze interne, con cambiamenti anche del sistema sociale
definition: Révolution, changement généralement violent de système politique et social dans un pays @fr
definition: An often violent change in a nation's system of government by internal forces that results in systematic social change. @en-gb
definition: Ein meist gewaltätiger Wechsel der Regierung eines Landes durch interne Kräfte, die in systematische soziale Veränderungen mündet. @de
definition: A menudo es un violento cambio en el sistema de gobierno de un país hecho por fuerzas internas dando resultado un cambio social sistemático. @es
definition: Alteração por vezes violenta do sistema governativo de um país, feita por forças internas que provocam mudanças sociais sistemáticas. @pt-br
definition: 政府が確立した国内体制に対しての内部勢力による劇的な変化であり、結果的に組織的な社会変動をもたらす @ja-jp
note: nessuno
in scheme: subjectcode
created: 2003-04-05T12:00:00+00:00
modified: 2012-07-10T12:00:00+00:00
broader: http://cv.iptc.org/newscodes/subjectcode/16003000