Attentato dinamitardo
type: Concept
preferred label: 爆弾テロ @ja-jp
preferred label: atentados à bomba @pt-pt
preferred label: bombardeo @es
preferred label: Bombenattentat @de
preferred label: Explosion de bombes @fr
preferred label: bombings @en-gb
definition: Action d'attaquer par bombes ou obus une cible matérielle @fr
definition: Uso de dispositivos explosivos contras pessoas, edifícios ou estruturas. @pt-br
definition: Einsatz von explosiven Materialien gegen Menschen, Gebäude oder Bauwerke. @de
definition: Uso de aparatos explosivos contra las personas, edificios o estructuras. @es
definition: Use of explosive devices against people, buildings or structures @en-gb
definition: Uso di dispositivi esplosivi contro persone, edifici o strutture
definition: 人々、建物あるいは構造物に対する爆発装置の使用 @ja-jp
note: nessuno
in scheme: subjectcode
created: 2003-04-05T12:00:00+00:00
modified: 2012-07-10T12:00:00+00:00
broader: http://cv.iptc.org/newscodes/subjectcode/16005000