Massacro
type: Concept
preferred label: Massacre @fr
preferred label: matanza @es
preferred label: massacre @pt-br
preferred label: Massaker @de
preferred label: 虐殺 @ja-jp
definition: Das Töten einer großen Menschengruppe über einen kurzen Zeitraum. @de
definition: Morte de um grande grupo de pessoas num curto período de tempo. @pt-pt
definition: Morte violenta di un vasto gruppo di persone nell'arco di un breve periodo di tempo
definition: Morte de um grande grupo de pessoas em um curto período de tempo. @pt-br
definition: The death of a large group of people over a brief period of time @en-gb
definition: Massacre, tuerie d'un grand nombre de personnes sur une période brève @fr
definition: La muerte de un grupo grande de personas sobre un breve periodo de tiempo. @es
definition: 短期間に多数の人間を殺害すること @ja-jp
note: nessuno
in scheme: subjectcode
created: 2000-10-30T12:00:00+00:00
modified: 2010-12-15T17:01:09+00:00
broader: http://cv.iptc.org/newscodes/subjectcode/16000000
narrower: http://cv.iptc.org/newscodes/subjectcode/16006001