Sommossa
type: Concept
preferred label: émeutes @fr
preferred label: Aufruhr @de
preferred label: motins @pt-br
preferred label: disturbios @es
preferred label: 暴動 @ja-jp
preferred label: riots @en-gb
definition: 暴力、たいてい個人に危害を加えたり、財産を破壊することを含む破壊的なデモ活動 @ja-jp
definition: Emeute, manifestation violente impliquant souvent blessés et destruction de biens publics ou d'autrui @fr
definition: Dimostrazione violenta e distruttiva che spesso implica feriti e distruzioni di proprietà
definition: Manifestações violentas, frequentemente envolvendo feridos e destruição de propriedade. @pt-pt
definition: Desmostraciones violentas y destructivas que normalmente generan heridos y la destrucción de propiedades. @es
definition: Violent, destructive demonstrations often involving injury to individuals and destruction of property @en-gb
definition: Gewaltätige und zerstörerische Demonstration, meist mit Verletzungen von Personen und der Zerstörung von Eigentum verbunden. @de
note: nessuno
in scheme: subjectcode
created: 2000-10-30T12:00:00+00:00
modified: 2010-12-15T17:01:09+00:00
broader: http://cv.iptc.org/newscodes/subjectcode/16000000