Guerra
type: Concept
preferred label: guerra @es
preferred label: war @en-gb
preferred label: Guerre @fr
preferred label: 戦争 @ja-jp
preferred label: Krieg @de
definition: A formal declaration of hostilities by one country against another @en-gb
definition: Declaração formal de hostilidades de um país a outro. @pt-pt
definition: Eine formale Feindschaftserklärung des einen Landes gegen ein anderes. @de
definition: La declaracionformal de hostilidades de un país hacia otro. @es
definition: 一つの国が別の国に対して行う交戦状態の正式な宣言 @ja-jp
definition: Formale dichiarazione di ostilità di un paese nei confronti di un altro
definition: Guerre entre pays @fr
note: nessuno
in scheme: subjectcode
created: 2000-10-30T12:00:00+00:00
modified: 2010-12-15T17:01:09+00:00
broader: http://cv.iptc.org/newscodes/subjectcode/16000000
narrower: http://cv.iptc.org/newscodes/subjectcode/16009001
narrower: http://cv.iptc.org/newscodes/subjectcode/16009002
narrower: http://cv.iptc.org/newscodes/subjectcode/16009003