Intervento militare internazionale
type: Concept
preferred label: Internationale militärische Intervention @de
preferred label: intervenciones militares internacionales @es
preferred label: 武力介入 @ja-jp
preferred label: intervenção militar internacional @pt-pt
preferred label: international military intervention @en-gb
preferred label: Interventions militaires @fr
definition: Uso temporário de forças internacionais, seja por convite ou por decisão de órgão estrangeiro, num país ou numa região com intenção de resolver uma crise. @pt-pt
definition: Temporäre Nutzung von Internationalen Streitkräften durch Aufforderung oder Entscheidung von Außenstehenden eines anderen Landes oder Region mit der Absicht eine Krise aufzulösen. @de
definition: Uso di forze militari internazionali in una nazione/regione su invito o decisione di una istituzione esterna con lo scopo di risolvere una crisi
definition: Empleo temporal de fuerzas internacionales por medio de una invitación o decisión de un cuerpo extranjero en otro país región con el propósito de resolver una crisis. @es
definition: 危機を解決する目的で、他国や地域における内部からの要請、または外部からの決定による一時的な国際軍事力の使用 @ja-jp
definition: Temporary use of international forces by invitation or by a decision of an outside body in another country or region for the purpose of resolving a crisis. @en-gb
definition: Force armée internationale s'interposant temporairement entre des bélligérants dans un processus de paix @fr
note: nessuno
in scheme: subjectcode
created: 2003-04-05T12:00:00+00:00
modified: 2012-07-10T12:00:00+00:00
broader: http://cv.iptc.org/newscodes/subjectcode/16009000