Prigionieri Guerra
type: Concept
preferred label: 捕虜・抑留者 @ja-jp
preferred label: prisoners and detainees @en-gb
preferred label: Kriegsgefangene @de
preferred label: prisioneiros e detidos @pt-br
preferred label: Prisonniers et détenus @fr
preferred label: prisioneros y detenidos @es
definition: Prisonniers et détenus pendant une guerre ou un conflit armé @fr
definition: Personas capturadas y retenidas por sus enemigos durante una guerra o conflicto armado. @es
definition: 戦争や武力紛争の期間に敵に捕虜にされたり、投獄された人々 @ja-jp
definition: People captured and imprisoned by their enemy during war or armed conflict @en-gb
definition: As pessoas capturadas e presas pelo inimigo durante guerras e conflitos armados. @pt-br
definition: Menschen, die während eines Krieges oder eines bewaffneten Konflikts von den Gegnern gefangengehalten werden. @de
definition: Persone catturate e imprigionate durante una guerra o un conflitto armato
note: nessuno
in scheme: subjectcode
created: 2003-11-26T12:00:00+00:00
modified: 2012-07-10T12:00:00+00:00
broader: http://cv.iptc.org/newscodes/subjectcode/16009000