Forces de maintien de la paix
type: Concept
preferred label: 平和維持軍 @ja-jp
preferred label: Peacekeeping @it
preferred label: força de paz @pt-pt
preferred label: fuerza de paz @es
preferred label: Friedenstruppe @de
preferred label: peacekeeping force @en-gb
definition: Forças militares de diferentes nacionalidade agrupadas sob comando internacional para manter a ordem em áreas de conflito. @pt-pt
definition: Fuerzas militares de distinta nacionalidad unificadas bajo un comando Internacional para mantener el orden de áreas en disputa. @es
definition: Varied national military forces under unified international command to maintain order in disputed areas. @en-gb
definition: Forces armées de plusieurs pays destinées, sous un commandement international unique, à maintenir l'ordre dans des zones en conflit
definition: 紛争が起きている地域で秩序を維持する、国際的な指揮の下で一体になった様々な国立軍事力 @ja-jp
definition: Verschiedene militärische Truppen unter einem internationalen Kommando, um die Stabilität in Konfliktregionen zu sichern. @de
definition: Forze militari di varie nazioni sotto un comando unificato internazionale incaricate di mantenere l'ordine e la pace in aree in conflitto tra loro @it
note: to version 9: violent demonstration
note: nessuno @it
in scheme: subjectcode
created: 2004-10-13T12:00:00+00:00
modified: 2012-07-10T12:00:00+00:00
broader: http://cv.iptc.org/newscodes/subjectcode/16010000